{"text_format":"1","workbook":"xlsx","n_sheets":3,"sheets":["Instructions","Scores","Settings"],"not_rendered":{"charts":0,"images":0,"macros":1,"external_links":0,"defined_names":0,"comments":0,"pivot_tables":0},"unopened":[],"bounds":{"document_bytes":16777216,"sheet_cells":100000,"rows_first":2000,"rows_last":500,"rows_between":2000,"halvings":0,"cell_chars":16384,"cell_head_chars":4096},"cells_cut":0,"cells_raw":0,"read":"whole","date_system":"1900"}

{"sheet":"Instructions","index":0,"n_rows":14,"n_cols":2,"rows_kept":14,"cut":false,"hidden":false,"merged":[[0,0,0,1],[1,0,1,1]]}
["Golf League Tracker Callaway Scoring Worksheet"]
["www.GolfLeagueTracker.com"]
[]
["About"]
[null,"The Callaway scoring system is designed for a one-day tournament where players don't have official handicaps, and "]
[null,"in fact, have a handicap calculated based on the round that they play.   For detailed information on how Callaway works"]
[null,"take a look at this article online:"]
[null,"https://www.thoughtco.com/how-to-use-the-callaway-system-1564469"]
[]
["Instructions"]
[1,"Enter the correct Par numbers for each hole of your course.  This is important since there is a double-par rule using the Callaway System"]
[2,"Input actual hole by hole scores"]
[3,"Standard rules for this system is to ignore the score on holes 17 and 18 for handciap adjustments.  This prevents a player from getting an artificially high score on 17 and 18 to inflate his handicap.  You also have the option to exclude the 16th hole by clicking on the \"Exclude\" button on the Settings sheet."]
[4,"Sheet is set for 40 players. If you want to use more players, just copy the *entire row* down.  Be sure to select the entire row so the hidden formulas are also copied. "]

{"sheet":"Scores","index":1,"n_rows":52,"n_cols":45,"rows_kept":52,"cut":false,"hidden":false,"merged":[]}
["Golf League Tracker Callaway Scoring"]
["www.GolfLeagueTracker.com"]
[]
[null,"Hole",1,2,3,4,5,6,7,8,9,10,11,12,13,14,15,16,17,18,"Total",1,2,3,4,5,6,7,8,9,10,11,12,13,14,15,16,17,18,null,"Worst",null,"Additional Stroke Adj","Hdcp","Net Score"]
["Player Name","Par",4,3,4,3,4,4,5,5,4,4,5,3,4,4,5,3,4,4,{"$f":"SUM(C5:T5)","v":72}]
["Player 1",null,4,4,4,4,6,6,6,4,4,4,4,4,4,4,4,4,4,4,{"$f":"IF(SUM(C6:T6)=0,\"\",SUM(C6:T6))","v":78},{"$f":"IF(C6>2*C$5,2*C$5,C6)","v":4},{"$f":"IF(D6>2*D$5,2*D$5,D6)","v":4},{"$f":"IF(E6>2*E$5,2*E$5,E6)","v":4},{"$f":"IF(F6>2*F$5,2*F$5,F6)","v":4},{"$f":"IF(G6>2*G$5,2*G$5,G6)","v":6},{"$f":"IF(H6>2*H$5,2*H$5,H6)","v":6},{"$f":"IF(I6>2*I$5,2*I$5,I6)","v":6},{"$f":"IF(J6>2*J$5,2*J$5,J6)","v":4},{"$f":"IF(K6>2*K$5,2*K$5,K6)","v":4},{"$f":"IF(L6>2*L$5,2*L$5,L6)","v":4},{"$f":"IF(M6>2*M$5,2*M$5,M6)","v":4},{"$f":"IF(N6>2*N$5,2*N$5,N6)","v":4},{"$f":"IF(O6>2*O$5,2*O$5,O6)","v":4},{"$f":"IF(P6>2*P$5,2*P$5,P6)","v":4},{"$f":"IF(Q6>2*Q$5,2*Q$5,Q6)","v":4},{"$f":"IF(R6>2*R$5,2*R$5,R6)","v":4},{"$f":"IF(S6>2*S$5,2*S$5,S6)","v":4},{"$f":"IF(T6>2*T$5,2*T$5,T6)","v":4},{"$f":"IF(U6>130,\"6 Worst Holes\",VLOOKUP(U6,Settings!$A$18:$J$80,2,FALSE))","v":"Worst Hole"},{"$f":"IF(AN6=\"Scratch\",\"0\",IF(AN6=\"1/2 of Worst Hole\",MAX(V6:AJ6)/2,IF(AN6=\"Worst Hole\",MAX(V6:AJ6),IF(AN6=\"1 1/2 Worst Holes\",MAX(V6:AJ6)+LARGE(V6:AJ6,2)/2,IF(AN6=\"2 Worst Holes\",MAX(V6:AJ6)+LARGE(V6:AJ6,2),IF(AN6=\"2 1/2 Worst Holes\",MAX(V6:AJ6)+LARGE(V6:AJ6,2)+LARGE(V6:AJ6,3)/2,IF(AN6=\"3 Worst Holes\",MAX(V6:AJ6)+LARGE(V6:AJ6,2)+LARGE(V6:AJ6,3),\"\")))))))","v":6},{"$f":"IF(AN6=\"3 1/2 Worst Holes\",MAX(V6:AJ6)+LARGE(V6:AJ6,2)+LARGE(V6:AJ6,3)+LARGE(V6:AJ6,4)/2,IF(AN6=\"4 Worst Holes\",MAX(V6:AJ6)+LARGE(V6:AJ6,2)+LARGE(V6:AJ6,3)+LARGE(V6:AJ6,4),IF(AN6=\"4 1/2 Worst Holes\",MAX(V6:AJ6)+LARGE(V6:AJ6,2)+LARGE(V6:AJ6,3)+LARGE(V6:AJ6,4)+LARGE(V6:AJ6,5)/2,IF(AN6=\"5 Worst Holes\",MAX(V6:AJ6)+LARGE(V6:AJ6,2)+LARGE(V6:AJ6,3)+LARGE(V6:AJ6,4)+LARGE(V6:AJ6,5),IF(AN6=\"5 1/2 Worst Holes\",MAX(V6:AJ6)+LARGE(V6:AJ6,2)+LARGE(V6:AJ6,3)+LARGE(V6:AJ6,4)+LARGE(V6:AJ6,5)+LARGE(V6:AJ6,5)/2,IF(AN6=\"6 Worst Holes\",MAX(V6:AJ6)+LARGE(V6:AJ6,2)+LARGE(V6:AJ6,3)+LARGE(V6:AJ6,4)+LARGE(V6:AJ6,5)+LARGE(V6:AJ6,5),\"\"))))))","v":""},{"$f":"VLOOKUP(U6,Settings!$A$18:$J$80,3,FALSE)","v":0},{"$f":"IF(ISERROR(IF(ISNUMBER(AO6),ROUND(AO6+AQ6,0),ROUND(AP6+AQ6,0))),0,IF(ISNUMBER(AO6),ROUND(AO6+AQ6,0),ROUND(AP6+AQ6,0)))","v":6},{"$f":"IF(ISERROR(AQ6),\"\",U6-AR6)","v":72}]
["Player 2",null,4,4,4,4,5,4,5,4,4,4,4,4,4,4,4,6,4,4,{"$f":"IF(SUM(C7:T7)=0,\"\",SUM(C7:T7))","v":76},{"$f":"IF(C7>2*C$5,2*C$5,C7)","v":4},{"$f":"IF(D7>2*D$5,2*D$5,D7)","v":4},{"$f":"IF(E7>2*E$5,2*E$5,E7)","v":4},{"$f":"IF(F7>2*F$5,2*F$5,F7)","v":4},{"$f":"IF(G7>2*G$5,2*G$5,G7)","v":5},{"$f":"IF(H7>2*H$5,2*H$5,H7)","v":4},{"$f":"IF(I7>2*I$5,2*I$5,I7)","v":5},{"$f":"IF(J7>2*J$5,2*J$5,J7)","v":4},{"$f":"IF(K7>2*K$5,2*K$5,K7)","v":4},{"$f":"IF(L7>2*L$5,2*L$5,L7)","v":4},{"$f":"IF(M7>2*M$5,2*M$5,M7)","v":4},{"$f":"IF(N7>2*N$5,2*N$5,N7)","v":4},{"$f":"IF(O7>2*O$5,2*O$5,O7)","v":4},{"$f":"IF(P7>2*P$5,2*P$5,P7)","v":4},{"$f":"IF(Q7>2*Q$5,2*Q$5,Q7)","v":4},{"$f":"IF(R7>2*R$5,2*R$5,R7)","v":6},{"$f":"IF(S7>2*S$5,2*S$5,S7)","v":4},{"$f":"IF(T7>2*T$5,2*T$5,T7)","v":4},{"$f":"IF(U7>130,\"6 Worst Holes\",VLOOKUP(U7,Settings!$A$18:$J$80,2,FALSE))","v":"Worst Hole"},{"$f":"IF(AN7=\"Scratch\",\"0\",IF(AN7=\"1/2 of Worst Hole\",MAX(V7:AJ7)/2,IF(AN7=\"Worst Hole\",MAX(V7:AJ7),IF(AN7=\"1 1/2 Worst Holes\",MAX(V7:AJ7)+LARGE(V7:AJ7,2)/2,IF(AN7=\"2 Worst Holes\",MAX(V7:AJ7)+LARGE(V7:AJ7,2),IF(AN7=\"2 1/2 Worst Holes\",MAX(V7:AJ7)+LARGE(V7:AJ7,2)+LARGE(V7:AJ7,3)/2,IF(AN7=\"3 Worst Holes\",MAX(V7:AJ7)+LARGE(V7:AJ7,2)+LARGE(V7:AJ7,3),\"\")))))))","v":5},{"$f":"IF(AN7=\"3 1/2 Worst Holes\",MAX(V7:AM7)+LARGE(V7:AM7,2)+LARGE(V7:AM7,3)+LARGE(V7:AM7,4)/2,IF(AN7=\"4 Worst Holes\",MAX(V7:AM7)+LARGE(V7:AM7,2)+LARGE(V7:AM7,3)+LARGE(V7:AM7,4),IF(AN7=\"4 1/2 Worst Holes\",MAX(V7:AM7)+LARGE(V7:AM7,2)+LARGE(V7:AM7,3)+LARGE(V7:AM7,4)+LARGE(V7:AM7,5)/2,IF(AN7=\"5 Worst Holes\",MAX(V7:AM7)+LARGE(V7:AM7,2)+LARGE(V7:AM7,3)+LARGE(V7:AM7,4)+LARGE(V7:AM7,5),IF(AN7=\"5 1/2 Worst Holes\",MAX(V7:AM7)+LARGE(V7:AM7,2)+LARGE(V7:AM7,3)+LARGE(V7:AM7,4)+LARGE(V7:AM7,5)+LARGE(V7:AM7,5)/2,IF(AN7=\"6 Worst Holes\",MAX(V7:AM7)+LARGE(V7:AM7,2)+LARGE(V7:AM7,3)+LARGE(V7:AM7,4)+LARGE(V7:AM7,5)+LARGE(V7:AM7,5),\"\"))))))","v":""},{"$f":"VLOOKUP(U7,Settings!$A$18:$J$80,3,FALSE)","v":-2},{"$f":"IF(ISERROR(IF(ISNUMBER(AO7),ROUND(AO7+AQ7,0),ROUND(AP7+AQ7,0))),0,IF(ISNUMBER(AO7),ROUND(AO7+AQ7,0),ROUND(AP7+AQ7,0)))","v":3},{"$f":"IF(ISERROR(AQ7),\"\",U7-AR7)","v":73}]
["Player 3",null,null,null,null,null,null,null,null,null,null,null,null,null,null,null,null,null,null,null,"",{"$f":"IF(C8>2*C$5,2*C$5,C8)","v":0},{"$f":"IF(D8>2*D$5,2*D$5,D8)","v":0},{"$f":"IF(E8>2*E$5,2*E$5,E8)","v":0},{"$f":"IF(F8>2*F$5,2*F$5,F8)","v":0},{"$f":"IF(G8>2*G$5,2*G$5,G8)","v":0},{"$f":"IF(H8>2*H$5,2*H$5,H8)","v":0},{"$f":"IF(I8>2*I$5,2*I$5,I8)","v":0},{"$f":"IF(J8>2*J$5,2*J$5,J8)","v":0},{"$f":"IF(K8>2*K$5,2*K$5,K8)","v":0},{"$f":"IF(L8>2*L$5,2*L$5,L8)","v":0},{"$f":"IF(M8>2*M$5,2*M$5,M8)","v":0},{"$f":"IF(N8>2*N$5,2*N$5,N8)","v":0},{"$f":"IF(O8>2*O$5,2*O$5,O8)","v":0},{"$f":"IF(P8>2*P$5,2*P$5,P8)","v":0},{"$f":"IF(Q8>2*Q$5,2*Q$5,Q8)","v":0},{"$f":"IF(R8>2*R$5,2*R$5,R8)","v":0},{"$f":"IF(S8>2*S$5,2*S$5,S8)","v":0},{"$f":"IF(T8>2*T$5,2*T$5,T8)","v":0},{"$f":"IF(U8>130,\"6 Worst Holes\",VLOOKUP(U8,Settings!$A$18:$J$80,2,FALSE))","v":"6 Worst Holes"},{"$f":"IF(AN8=\"Scratch\",\"0\",IF(AN8=\"1/2 of Worst Hole\",MAX(V8:AJ8)/2,IF(AN8=\"Worst Hole\",MAX(V8:AJ8),IF(AN8=\"1 1/2 Worst Holes\",MAX(V8:AJ8)+LARGE(V8:AJ8,2)/2,IF(AN8=\"2 Worst Holes\",MAX(V8:AJ8)+LARGE(V8:AJ8,2),IF(AN8=\"2 1/2 Worst Holes\",MAX(V8:AJ8)+LARGE(V8:AJ8,2)+LARGE(V8:AJ8,3)/2,IF(AN8=\"3 Worst Holes\",MAX(V8:AJ8)+LARGE(V8:AJ8,2)+LARGE(V8:AJ8,3),\"\")))))))","v":""},{"$f":"IF(AN8=\"3 1/2 Worst Holes\",MAX(V8:AM8)+LARGE(V8:AM8,2)+LARGE(V8:AM8,3)+LARGE(V8:AM8,4)/2,IF(AN8=\"4 Worst Holes\",MAX(V8:AM8)+LARGE(V8:AM8,2)+LARGE(V8:AM8,3)+LARGE(V8:AM8,4),IF(AN8=\"4 1/2 Worst Holes\",MAX(V8:AM8)+LARGE(V8:AM8,2)+LARGE(V8:AM8,3)+LARGE(V8:AM8,4)+LARGE(V8:AM8,5)/2,IF(AN8=\"5 Worst Holes\",MAX(V8:AM8)+LARGE(V8:AM8,2)+LARGE(V8:AM8,3)+LARGE(V8:AM8,4)+LARGE(V8:AM8,5),IF(AN8=\"5 1/2 Worst Holes\",MAX(V8:AM8)+LARGE(V8:AM8,2)+LARGE(V8:AM8,3)+LARGE(V8:AM8,4)+LARGE(V8:AM8,5)+LARGE(V8:AM8,5)/2,IF(AN8=\"6 Worst Holes\",MAX(V8:AM8)+LARGE(V8:AM8,2)+LARGE(V8:AM8,3)+LARGE(V8:AM8,4)+LARGE(V8:AM8,5)+LARGE(V8:AM8,5),\"\"))))))","v":0},{"$f":"VLOOKUP(U8,Settings!$A$18:$J$80,3,FALSE)","v":{"$error":"#N/A"}},{"$f":"IF(ISERROR(IF(ISNUMBER(AO8),ROUND(AO8+AQ8,0),ROUND(AP8+AQ8,0))),0,IF(ISNUMBER(AO8),ROUND(AO8+AQ8,0),ROUND(AP8+AQ8,0)))","v":0},{"$f":"IF(ISERROR(AQ8),\"\",U8-AR8)","v":""}]
["Player 4",null,null,null,null,null,null,null,null,null,null,null,null,null,null,null,null,null,null,null,"",{"$f":"IF(C9>2*C$5,2*C$5,C9)","v":0},{"$f":"IF(D9>2*D$5,2*D$5,D9)","v":0},{"$f":"IF(E9>2*E$5,2*E$5,E9)","v":0},{"$f":"IF(F9>2*F$5,2*F$5,F9)","v":0},{"$f":"IF(G9>2*G$5,2*G$5,G9)","v":0},{"$f":"IF(H9>2*H$5,2*H$5,H9)","v":0},{"$f":"IF(I9>2*I$5,2*I$5,I9)","v":0},{"$f":"IF(J9>2*J$5,2*J$5,J9)","v":0},{"$f":"IF(K9>2*K$5,2*K$5,K9)","v":0},{"$f":"IF(L9>2*L$5,2*L$5,L9)","v":0},{"$f":"IF(M9>2*M$5,2*M$5,M9)","v":0},{"$f":"IF(N9>2*N$5,2*N$5,N9)","v":0},{"$f":"IF(O9>2*O$5,2*O$5,O9)","v":0},{"$f":"IF(P9>2*P$5,2*P$5,P9)","v":0},{"$f":"IF(Q9>2*Q$5,2*Q$5,Q9)","v":0},{"$f":"IF(R9>2*R$5,2*R$5,R9)","v":0},{"$f":"IF(S9>2*S$5,2*S$5,S9)","v":0},{"$f":"IF(T9>2*T$5,2*T$5,T9)","v":0},{"$f":"IF(U9>130,\"6 Worst Holes\",VLOOKUP(U9,Settings!$A$18:$J$80,2,FALSE))","v":"6 Worst Holes"},{"$f":"IF(AN9=\"Scratch\",\"0\",IF(AN9=\"1/2 of Worst Hole\",MAX(V9:AJ9)/2,IF(AN9=\"Worst Hole\",MAX(V9:AJ9),IF(AN9=\"1 1/2 Worst Holes\",MAX(V9:AJ9)+LARGE(V9:AJ9,2)/2,IF(AN9=\"2 Worst Holes\",MAX(V9:AJ9)+LARGE(V9:AJ9,2),IF(AN9=\"2 1/2 Worst Holes\",MAX(V9:AJ9)+LARGE(V9:AJ9,2)+LARGE(V9:AJ9,3)/2,IF(AN9=\"3 Worst Holes\",MAX(V9:AJ9)+LARGE(V9:AJ9,2)+LARGE(V9:AJ9,3),\"\")))))))","v":""},{"$f":"IF(AN9=\"3 1/2 Worst Holes\",MAX(V9:AM9)+LARGE(V9:AM9,2)+LARGE(V9:AM9,3)+LARGE(V9:AM9,4)/2,IF(AN9=\"4 Worst Holes\",MAX(V9:AM9)+LARGE(V9:AM9,2)+LARGE(V9:AM9,3)+LARGE(V9:AM9,4),IF(AN9=\"4 1/2 Worst Holes\",MAX(V9:AM9)+LARGE(V9:AM9,2)+LARGE(V9:AM9,3)+LARGE(V9:AM9,4)+LARGE(V9:AM9,5)/2,IF(AN9=\"5 Worst Holes\",MAX(V9:AM9)+LARGE(V9:AM9,2)+LARGE(V9:AM9,3)+LARGE(V9:AM9,4)+LARGE(V9:AM9,5),IF(AN9=\"5 1/2 Worst Holes\",MAX(V9:AM9)+LARGE(V9:AM9,2)+LARGE(V9:AM9,3)+LARGE(V9:AM9,4)+LARGE(V9:AM9,5)+LARGE(V9:AM9,5)/2,IF(AN9=\"6 Worst Holes\",MAX(V9:AM9)+LARGE(V9:AM9,2)+LARGE(V9:AM9,3)+LARGE(V9:AM9,4)+LARGE(V9:AM9,5)+LARGE(V9:AM9,5),\"\"))))))","v":0},{"$f":"VLOOKUP(U9,Settings!$A$18:$J$80,3,FALSE)","v":{"$error":"#N/A"}},{"$f":"IF(ISERROR(IF(ISNUMBER(AO9),ROUND(AO9+AQ9,0),ROUND(AP9+AQ9,0))),0,IF(ISNUMBER(AO9),ROUND(AO9+AQ9,0),ROUND(AP9+AQ9,0)))","v":0},{"$f":"IF(ISERROR(AQ9),\"\",U9-AR9)","v":""}]
["Player 5",null,null,null,null,null,null,null,null,null,null,null,null,null,null,null,null,null,null,null,"",{"$f":"IF(C10>2*C$5,2*C$5,C10)","v":0},{"$f":"IF(D10>2*D$5,2*D$5,D10)","v":0},{"$f":"IF(E10>2*E$5,2*E$5,E10)","v":0},{"$f":"IF(F10>2*F$5,2*F$5,F10)","v":0},{"$f":"IF(G10>2*G$5,2*G$5,G10)","v":0},{"$f":"IF(H10>2*H$5,2*H$5,H10)","v":0},{"$f":"IF(I10>2*I$5,2*I$5,I10)","v":0},{"$f":"IF(J10>2*J$5,2*J$5,J10)","v":0},{"$f":"IF(K10>2*K$5,2*K$5,K10)","v":0},{"$f":"IF(L10>2*L$5,2*L$5,L10)","v":0},{"$f":"IF(M10>2*M$5,2*M$5,M10)","v":0},{"$f":"IF(N10>2*N$5,2*N$5,N10)","v":0},{"$f":"IF(O10>2*O$5,2*O$5,O10)","v":0},{"$f":"IF(P10>2*P$5,2*P$5,P10)","v":0},{"$f":"IF(Q10>2*Q$5,2*Q$5,Q10)","v":0},{"$f":"IF(R10>2*R$5,2*R$5,R10)","v":0},{"$f":"IF(S10>2*S$5,2*S$5,S10)","v":0},{"$f":"IF(T10>2*T$5,2*T$5,T10)","v":0},{"$f":"IF(U10>130,\"6 Worst Holes\",VLOOKUP(U10,Settings!$A$18:$J$80,2,FALSE))","v":"6 Worst Holes"},{"$f":"IF(AN10=\"Scratch\",\"0\",IF(AN10=\"1/2 of Worst Hole\",MAX(V10:AJ10)/2,IF(AN10=\"Worst Hole\",MAX(V10:AJ10),IF(AN10=\"1 1/2 Worst Holes\",MAX(V10:AJ10)+LARGE(V10:AJ10,2)/2,IF(AN10=\"2 Worst Holes\",MAX(V10:AJ10)+LARGE(V10:AJ10,2),IF(AN10=\"2 1/2 Worst Holes\",MAX(V10:AJ10)+LARGE(V10:AJ10,2)+LARGE(V10:AJ10,3)/2,IF(AN10=\"3 Worst Holes\",MAX(V10:AJ10)+LARGE(V10:AJ10,2)+LARGE(V10:AJ10,3),\"\")))))))","v":""},{"$f":"IF(AN10=\"3 1/2 Worst Holes\",MAX(V10:AM10)+LARGE(V10:AM10,2)+LARGE(V10:AM10,3)+LARGE(V10:AM10,4)/2,IF(AN10=\"4 Worst Holes\",MAX(V10:AM10)+LARGE(V10:AM10,2)+LARGE(V10:AM10,3)+LARGE(V10:AM10,4),IF(AN10=\"4 1/2 Worst Holes\",MAX(V10:AM10)+LARGE(V10:AM10,2)+LARGE(V10:AM10,3)+LARGE(V10:AM10,4)+LARGE(V10:AM10,5)/2,IF(AN10=\"5 Worst Holes\",MAX(V10:AM10)+LARGE(V10:AM10,2)+LARGE(V10:AM10,3)+LARGE(V10:AM10,4)+LARGE(V10:AM10,5),IF(AN10=\"5 1/2 Worst Holes\",MAX(V10:AM10)+LARGE(V10:AM10,2)+LARGE(V10:AM10,3)+LARGE(V10:AM10,4)+LARGE(V10:AM10,5)+LARGE(V10:AM10,5)/2,IF(AN10=\"6 Worst Holes\",MAX(V10:AM10)+LARGE(V10:AM10,2)+LARGE(V10:AM10,3)+LARGE(V10:AM10,4)+LARGE(V10:AM10,5)+LARGE(V10:AM10,5),\"\"))))))","v":0},{"$f":"VLOOKUP(U10,Settings!$A$18:$J$80,3,FALSE)","v":{"$error":"#N/A"}},{"$f":"IF(ISERROR(IF(ISNUMBER(AO10),ROUND(AO10+AQ10,0),ROUND(AP10+AQ10,0))),0,IF(ISNUMBER(AO10),ROUND(AO10+AQ10,0),ROUND(AP10+AQ10,0)))","v":0},{"$f":"IF(ISERROR(AQ10),\"\",U10-AR10)","v":""}]
["Player 6",null,null,null,null,null,null,null,null,null,null,null,null,null,null,null,null,null,null,null,{"$f":"IF(SUM(C11:T11)=0,\"\",SUM(C11:T11))","v":""},{"$f":"IF(C11>2*C$5,2*C$5,C11)","v":0},{"$f":"IF(D11>2*D$5,2*D$5,D11)","v":0},{"$f":"IF(E11>2*E$5,2*E$5,E11)","v":0},{"$f":"IF(F11>2*F$5,2*F$5,F11)","v":0},{"$f":"IF(G11>2*G$5,2*G$5,G11)","v":0},{"$f":"IF(H11>2*H$5,2*H$5,H11)","v":0},{"$f":"IF(I11>2*I$5,2*I$5,I11)","v":0},{"$f":"IF(J11>2*J$5,2*J$5,J11)","v":0},{"$f":"IF(K11>2*K$5,2*K$5,K11)","v":0},{"$f":"IF(L11>2*L$5,2*L$5,L11)","v":0},{"$f":"IF(M11>2*M$5,2*M$5,M11)","v":0},{"$f":"IF(N11>2*N$5,2*N$5,N11)","v":0},{"$f":"IF(O11>2*O$5,2*O$5,O11)","v":0},{"$f":"IF(P11>2*P$5,2*P$5,P11)","v":0},{"$f":"IF(Q11>2*Q$5,2*Q$5,Q11)","v":0},{"$f":"IF(R11>2*R$5,2*R$5,R11)","v":0},{"$f":"IF(S11>2*S$5,2*S$5,S11)","v":0},{"$f":"IF(T11>2*T$5,2*T$5,T11)","v":0},{"$f":"IF(U11>130,\"6 Worst Holes\",VLOOKUP(U11,Settings!$A$18:$J$80,2,FALSE))","v":"6 Worst Holes"},{"$f":"IF(AN11=\"Scratch\",\"0\",IF(AN11=\"1/2 of Worst Hole\",MAX(V11:AJ11)/2,IF(AN11=\"Worst Hole\",MAX(V11:AJ11),IF(AN11=\"1 1/2 Worst Holes\",MAX(V11:AJ11)+LARGE(V11:AJ11,2)/2,IF(AN11=\"2 Worst Holes\",MAX(V11:AJ11)+LARGE(V11:AJ11,2),IF(AN11=\"2 1/2 Worst Holes\",MAX(V11:AJ11)+LARGE(V11:AJ11,2)+LARGE(V11:AJ11,3)/2,IF(AN11=\"3 Worst Holes\",MAX(V11:AJ11)+LARGE(V11:AJ11,2)+LARGE(V11:AJ11,3),\"\")))))))","v":""},{"$f":"IF(AN11=\"3 1/2 Worst Holes\",MAX(V11:AM11)+LARGE(V11:AM11,2)+LARGE(V11:AM11,3)+LARGE(V11:AM11,4)/2,IF(AN11=\"4 Worst Holes\",MAX(V11:AM11)+LARGE(V11:AM11,2)+LARGE(V11:AM11,3)+LARGE(V11:AM11,4),IF(AN11=\"4 1/2 Worst Holes\",MAX(V11:AM11)+LARGE(V11:AM11,2)+LARGE(V11:AM11,3)+LARGE(V11:AM11,4)+LARGE(V11:AM11,5)/2,IF(AN11=\"5 Worst Holes\",MAX(V11:AM11)+LARGE(V11:AM11,2)+LARGE(V11:AM11,3)+LARGE(V11:AM11,4)+LARGE(V11:AM11,5),IF(AN11=\"5 1/2 Worst Holes\",MAX(V11:AM11)+LARGE(V11:AM11,2)+LARGE(V11:AM11,3)+LARGE(V11:AM11,4)+LARGE(V11:AM11,5)+LARGE(V11:AM11,5)/2,IF(AN11=\"6 Worst Holes\",MAX(V11:AM11)+LARGE(V11:AM11,2)+LARGE(V11:AM11,3)+LARGE(V11:AM11,4)+LARGE(V11:AM11,5)+LARGE(V11:AM11,5),\"\"))))))","v":0},{"$f":"VLOOKUP(U11,Settings!$A$18:$J$80,3,FALSE)","v":{"$error":"#N/A"}},{"$f":"IF(ISERROR(IF(ISNUMBER(AO11),ROUND(AO11+AQ11,0),ROUND(AP11+AQ11,0))),0,IF(ISNUMBER(AO11),ROUND(AO11+AQ11,0),ROUND(AP11+AQ11,0)))","v":0},{"$f":"IF(ISERROR(AQ11),\"\",U11-AR11)","v":""}]
["Player 7",null,null,null,null,null,null,null,null,null,null,null,null,null,null,null,null,null,null,null,"",0,0,0,0,0,0,0,0,0,0,0,0,0,0,0,0,0,0,{"$f":"IF(U12>130,\"6 Worst Holes\",VLOOKUP(U12,Settings!$A$18:$J$80,2,FALSE))","v":"6 Worst Holes"},{"$f":"IF(AN12=\"Scratch\",\"0\",IF(AN12=\"1/2 of Worst Hole\",MAX(V12:AJ12)/2,IF(AN12=\"Worst Hole\",MAX(V12:AJ12),IF(AN12=\"1 1/2 Worst Holes\",MAX(V12:AJ12)+LARGE(V12:AJ12,2)/2,IF(AN12=\"2 Worst Holes\",MAX(V12:AJ12)+LARGE(V12:AJ12,2),IF(AN12=\"2 1/2 Worst Holes\",MAX(V12:AJ12)+LARGE(V12:AJ12,2)+LARGE(V12:AJ12,3)/2,IF(AN12=\"3 Worst Holes\",MAX(V12:AJ12)+LARGE(V12:AJ12,2)+LARGE(V12:AJ12,3),\"\")))))))","v":""},{"$f":"IF(AN12=\"3 1/2 Worst Holes\",MAX(V12:AM12)+LARGE(V12:AM12,2)+LARGE(V12:AM12,3)+LARGE(V12:AM12,4)/2,IF(AN12=\"4 Worst Holes\",MAX(V12:AM12)+LARGE(V12:AM12,2)+LARGE(V12:AM12,3)+LARGE(V12:AM12,4),IF(AN12=\"4 1/2 Worst Holes\",MAX(V12:AM12)+LARGE(V12:AM12,2)+LARGE(V12:AM12,3)+LARGE(V12:AM12,4)+LARGE(V12:AM12,5)/2,IF(AN12=\"5 Worst Holes\",MAX(V12:AM12)+LARGE(V12:AM12,2)+LARGE(V12:AM12,3)+LARGE(V12:AM12,4)+LARGE(V12:AM12,5),IF(AN12=\"5 1/2 Worst Holes\",MAX(V12:AM12)+LARGE(V12:AM12,2)+LARGE(V12:AM12,3)+LARGE(V12:AM12,4)+LARGE(V12:AM12,5)+LARGE(V12:AM12,5)/2,IF(AN12=\"6 Worst Holes\",MAX(V12:AM12)+LARGE(V12:AM12,2)+LARGE(V12:AM12,3)+LARGE(V12:AM12,4)+LARGE(V12:AM12,5)+LARGE(V12:AM12,5),\"\"))))))","v":0},{"$f":"VLOOKUP(U12,Settings!$A$18:$J$80,3,FALSE)","v":{"$error":"#N/A"}},{"$f":"IF(ISERROR(IF(ISNUMBER(AO12),ROUND(AO12+AQ12,0),ROUND(AP12+AQ12,0))),0,IF(ISNUMBER(AO12),ROUND(AO12+AQ12,0),ROUND(AP12+AQ12,0)))","v":0},{"$f":"IF(ISERROR(AQ12),\"\",U12-AR12)","v":""}]
["Player 8",null,null,null,null,null,null,null,null,null,null,null,null,null,null,null,null,null,null,null,"",0,0,0,0,0,0,0,0,0,0,0,0,0,0,0,0,0,0,{"$f":"IF(U13>130,\"6 Worst Holes\",VLOOKUP(U13,Settings!$A$18:$J$80,2,FALSE))","v":"6 Worst Holes"},{"$f":"IF(AN13=\"Scratch\",\"0\",IF(AN13=\"1/2 of Worst Hole\",MAX(V13:AJ13)/2,IF(AN13=\"Worst Hole\",MAX(V13:AJ13),IF(AN13=\"1 1/2 Worst Holes\",MAX(V13:AJ13)+LARGE(V13:AJ13,2)/2,IF(AN13=\"2 Worst Holes\",MAX(V13:AJ13)+LARGE(V13:AJ13,2),IF(AN13=\"2 1/2 Worst Holes\",MAX(V13:AJ13)+LARGE(V13:AJ13,2)+LARGE(V13:AJ13,3)/2,IF(AN13=\"3 Worst Holes\",MAX(V13:AJ13)+LARGE(V13:AJ13,2)+LARGE(V13:AJ13,3),\"\")))))))","v":""},{"$f":"IF(AN13=\"3 1/2 Worst Holes\",MAX(V13:AM13)+LARGE(V13:AM13,2)+LARGE(V13:AM13,3)+LARGE(V13:AM13,4)/2,IF(AN13=\"4 Worst Holes\",MAX(V13:AM13)+LARGE(V13:AM13,2)+LARGE(V13:AM13,3)+LARGE(V13:AM13,4),IF(AN13=\"4 1/2 Worst Holes\",MAX(V13:AM13)+LARGE(V13:AM13,2)+LARGE(V13:AM13,3)+LARGE(V13:AM13,4)+LARGE(V13:AM13,5)/2,IF(AN13=\"5 Worst Holes\",MAX(V13:AM13)+LARGE(V13:AM13,2)+LARGE(V13:AM13,3)+LARGE(V13:AM13,4)+LARGE(V13:AM13,5),IF(AN13=\"5 1/2 Worst Holes\",MAX(V13:AM13)+LARGE(V13:AM13,2)+LARGE(V13:AM13,3)+LARGE(V13:AM13,4)+LARGE(V13:AM13,5)+LARGE(V13:AM13,5)/2,IF(AN13=\"6 Worst Holes\",MAX(V13:AM13)+LARGE(V13:AM13,2)+LARGE(V13:AM13,3)+LARGE(V13:AM13,4)+LARGE(V13:AM13,5)+LARGE(V13:AM13,5),\"\"))))))","v":0},{"$f":"VLOOKUP(U13,Settings!$A$18:$J$80,3,FALSE)","v":{"$error":"#N/A"}},{"$f":"IF(ISERROR(IF(ISNUMBER(AO13),ROUND(AO13+AQ13,0),ROUND(AP13+AQ13,0))),0,IF(ISNUMBER(AO13),ROUND(AO13+AQ13,0),ROUND(AP13+AQ13,0)))","v":0},{"$f":"IF(ISERROR(AQ13),\"\",U13-AR13)","v":""}]
["Player 9",null,null,null,null,null,null,null,null,null,null,null,null,null,null,null,null,null,null,null,{"$f":"IF(SUM(C14:T14)=0,\"\",SUM(C14:T14))","v":""},{"$f":"IF(C14>2*C$5,2*C$5,C14)","v":0},{"$f":"IF(D14>2*D$5,2*D$5,D14)","v":0},{"$f":"IF(E14>2*E$5,2*E$5,E14)","v":0},{"$f":"IF(F14>2*F$5,2*F$5,F14)","v":0},{"$f":"IF(G14>2*G$5,2*G$5,G14)","v":0},{"$f":"IF(H14>2*H$5,2*H$5,H14)","v":0},{"$f":"IF(I14>2*I$5,2*I$5,I14)","v":0},{"$f":"IF(J14>2*J$5,2*J$5,J14)","v":0},{"$f":"IF(K14>2*K$5,2*K$5,K14)","v":0},{"$f":"IF(L14>2*L$5,2*L$5,L14)","v":0},{"$f":"IF(M14>2*M$5,2*M$5,M14)","v":0},{"$f":"IF(N14>2*N$5,2*N$5,N14)","v":0},{"$f":"IF(O14>2*O$5,2*O$5,O14)","v":0},{"$f":"IF(P14>2*P$5,2*P$5,P14)","v":0},{"$f":"IF(Q14>2*Q$5,2*Q$5,Q14)","v":0},{"$f":"IF(R14>2*R$5,2*R$5,R14)","v":0},{"$f":"IF(S14>2*S$5,2*S$5,S14)","v":0},{"$f":"IF(T14>2*T$5,2*T$5,T14)","v":0},{"$f":"IF(U14>130,\"6 Worst Holes\",VLOOKUP(U14,Settings!$A$18:$J$80,2,FALSE))","v":"6 Worst Holes"},{"$f":"IF(AN14=\"Scratch\",\"0\",IF(AN14=\"1/2 of Worst Hole\",MAX(V14:AJ14)/2,IF(AN14=\"Worst Hole\",MAX(V14:AJ14),IF(AN14=\"1 1/2 Worst Holes\",MAX(V14:AJ14)+LARGE(V14:AJ14,2)/2,IF(AN14=\"2 Worst Holes\",MAX(V14:AJ14)+LARGE(V14:AJ14,2),IF(AN14=\"2 1/2 Worst Holes\",MAX(V14:AJ14)+LARGE(V14:AJ14,2)+LARGE(V14:AJ14,3)/2,IF(AN14=\"3 Worst Holes\",MAX(V14:AJ14)+LARGE(V14:AJ14,2)+LARGE(V14:AJ14,3),\"\")))))))","v":""},{"$f":"IF(AN14=\"3 1/2 Worst Holes\",MAX(V14:AM14)+LARGE(V14:AM14,2)+LARGE(V14:AM14,3)+LARGE(V14:AM14,4)/2,IF(AN14=\"4 Worst Holes\",MAX(V14:AM14)+LARGE(V14:AM14,2)+LARGE(V14:AM14,3)+LARGE(V14:AM14,4),IF(AN14=\"4 1/2 Worst Holes\",MAX(V14:AM14)+LARGE(V14:AM14,2)+LARGE(V14:AM14,3)+LARGE(V14:AM14,4)+LARGE(V14:AM14,5)/2,IF(AN14=\"5 Worst Holes\",MAX(V14:AM14)+LARGE(V14:AM14,2)+LARGE(V14:AM14,3)+LARGE(V14:AM14,4)+LARGE(V14:AM14,5),IF(AN14=\"5 1/2 Worst Holes\",MAX(V14:AM14)+LARGE(V14:AM14,2)+LARGE(V14:AM14,3)+LARGE(V14:AM14,4)+LARGE(V14:AM14,5)+LARGE(V14:AM14,5)/2,IF(AN14=\"6 Worst Holes\",MAX(V14:AM14)+LARGE(V14:AM14,2)+LARGE(V14:AM14,3)+LARGE(V14:AM14,4)+LARGE(V14:AM14,5)+LARGE(V14:AM14,5),\"\"))))))","v":0},{"$f":"VLOOKUP(U14,Settings!$A$18:$J$80,3,FALSE)","v":{"$error":"#N/A"}},{"$f":"IF(ISERROR(IF(ISNUMBER(AO14),ROUND(AO14+AQ14,0),ROUND(AP14+AQ14,0))),0,IF(ISNUMBER(AO14),ROUND(AO14+AQ14,0),ROUND(AP14+AQ14,0)))","v":0},{"$f":"IF(ISERROR(AQ14),\"\",U14-AR14)","v":""}]
["Player 10",null,null,null,null,null,null,null,null,null,null,null,null,null,null,null,null,null,null,null,"",0,0,0,0,0,0,0,0,0,0,0,0,0,0,0,0,0,0,{"$f":"IF(U15>130,\"6 Worst Holes\",VLOOKUP(U15,Settings!$A$18:$J$80,2,FALSE))","v":"6 Worst Holes"},{"$f":"IF(AN15=\"Scratch\",\"0\",IF(AN15=\"1/2 of Worst Hole\",MAX(V15:AJ15)/2,IF(AN15=\"Worst Hole\",MAX(V15:AJ15),IF(AN15=\"1 1/2 Worst Holes\",MAX(V15:AJ15)+LARGE(V15:AJ15,2)/2,IF(AN15=\"2 Worst Holes\",MAX(V15:AJ15)+LARGE(V15:AJ15,2),IF(AN15=\"2 1/2 Worst Holes\",MAX(V15:AJ15)+LARGE(V15:AJ15,2)+LARGE(V15:AJ15,3)/2,IF(AN15=\"3 Worst Holes\",MAX(V15:AJ15)+LARGE(V15:AJ15,2)+LARGE(V15:AJ15,3),\"\")))))))","v":""},{"$f":"IF(AN15=\"3 1/2 Worst Holes\",MAX(V15:AM15)+LARGE(V15:AM15,2)+LARGE(V15:AM15,3)+LARGE(V15:AM15,4)/2,IF(AN15=\"4 Worst Holes\",MAX(V15:AM15)+LARGE(V15:AM15,2)+LARGE(V15:AM15,3)+LARGE(V15:AM15,4),IF(AN15=\"4 1/2 Worst Holes\",MAX(V15:AM15)+LARGE(V15:AM15,2)+LARGE(V15:AM15,3)+LARGE(V15:AM15,4)+LARGE(V15:AM15,5)/2,IF(AN15=\"5 Worst Holes\",MAX(V15:AM15)+LARGE(V15:AM15,2)+LARGE(V15:AM15,3)+LARGE(V15:AM15,4)+LARGE(V15:AM15,5),IF(AN15=\"5 1/2 Worst Holes\",MAX(V15:AM15)+LARGE(V15:AM15,2)+LARGE(V15:AM15,3)+LARGE(V15:AM15,4)+LARGE(V15:AM15,5)+LARGE(V15:AM15,5)/2,IF(AN15=\"6 Worst Holes\",MAX(V15:AM15)+LARGE(V15:AM15,2)+LARGE(V15:AM15,3)+LARGE(V15:AM15,4)+LARGE(V15:AM15,5)+LARGE(V15:AM15,5),\"\"))))))","v":0},{"$f":"VLOOKUP(U15,Settings!$A$18:$J$80,3,FALSE)","v":{"$error":"#N/A"}},{"$f":"IF(ISERROR(IF(ISNUMBER(AO15),ROUND(AO15+AQ15,0),ROUND(AP15+AQ15,0))),0,IF(ISNUMBER(AO15),ROUND(AO15+AQ15,0),ROUND(AP15+AQ15,0)))","v":0},{"$f":"IF(ISERROR(AQ15),\"\",U15-AR15)","v":""}]
{"$rows_left_out":38}
{"sheet":"Settings","index":2,"n_rows":80,"n_cols":15,"rows_kept":80,"cut":false,"hidden":false,"merged":[[3,5,3,8],[4,5,4,8],[5,5,5,8],[6,5,6,8],[0,0,0,4],[0,5,0,8],[1,5,1,8],[2,5,2,8],[14,5,14,8],[11,5,11,8],[12,5,12,8],[13,5,13,8],[7,5,7,8],[8,5,8,8],[9,5,9,8],[10,5,10,8]]}
["Gross (using double par max.)",null,null,null,null,"Handicap Deduction"]
[null,null,70,71,72,"Scratch",null,null,null,null,null,null,null,null,"You can choose to exclude the 16th"]
[73,74,75,null,null,"1/2 of Worst Hole",null,null,null,null,null,null,null,null,"hole from the \"worst hole\" calculation."]
[76,77,78,79,80,"Worst Hole"]
[81,82,83,84,85,"1 1/2 Worst Holes",null,null,null,null,null,null,null,null,"The idea is to prevent a player from using the"]
[86,87,88,89,90,"2 Worst Holes",null,null,null,null,null,null,null,null,"last 2 or 3 holes to jack up his handicap"]
[91,92,93,94,95,"2 1/2 Worst Holes"]
[96,97,98,99,100,"3 Worst Holes"]
[101,102,103,104,105,"3 1/2 Worst Holes"]
[106,107,108,109,110,"4 Worst Holes"]
[111,112,113,114,115,"4 1/2 Worst Holes"]
[116,117,118,119,120,"5 Worst Holes"]
[121,122,123,124,125,"5 1/2 Worst Holes"]
[126,127,128,129,130,"6 Worst Holes"]
[-2,-1,0,1,2,"Handicap Adjustment"]
{"$rows_left_out":65}